{"text_format":"1","workbook":"xlsx","n_sheets":6,"sheets":["Intro","Table 1","Table 2","Table 3","Volumes","Volumes Variance"],"not_rendered":{"charts":0,"images":1,"macros":1,"external_links":1,"defined_names":2901,"comments":0,"pivot_tables":0},"unopened":[],"bounds":{"document_bytes":16777216,"sheet_cells":100000,"rows_first":2000,"rows_last":500,"rows_between":2000,"halvings":0,"cell_chars":16384,"cell_head_chars":4096},"cells_cut":0,"cells_raw":0,"read":"whole","date_system":"1900"}

{"sheet":"Intro","index":0,"n_rows":0,"n_cols":0,"rows_kept":0,"cut":false,"hidden":false,"merged":[]}

{"sheet":"Table 1","index":1,"n_rows":56,"n_cols":17,"rows_kept":56,"cut":false,"hidden":false,"merged":[[4,16,6,16],[32,0,33,0],[29,0,30,0],[32,16,33,16],[29,16,30,16],[5,0,6,0],[4,2,6,2],[4,1,6,1]]}
["Company Name:","Northern Powergrid (Northeast) plc"]
["Date:","August 2022"]
["Title:","DCUSA Schedule 15 - Table 1 information"]
[]
["Description","Licence Term","CRC",null,null,null,null,null,null,null,null,null,null,null,null,null,"Assumptions"]
["Regulatory Year",null,null,"t-8","t-7","t-6","t-5","t-4","t-3","t-2","t-1","t","t+1","t+2","t+3","t+4"]
[null,null,null,"2014/15",{"$f":"LEFT(D7,4)+1&\"/\"&RIGHT(D7,2)+1","v":"2015/16"},{"$f":"LEFT(E7,4)+1&\"/\"&RIGHT(E7,2)+1","v":"2016/17"},{"$f":"LEFT(F7,4)+1&\"/\"&RIGHT(F7,2)+1","v":"2017/18"},"2018/19","2019/20","2020/21","2021/22","2022/23","2023/24","2024/25","2025/26","2026/27"]
["Base Demand Revenue before inflation (A1)","PU","CRC2A",281.10000000000002,249.1,246.5,246.5,246.5,246.5,246.5,246.5,246.5,247.12743671308408,236.91261215231734,232.49889765472778,228.78034665985871,"PU values are aligned to the Competition & Markets Authority decision to adjust our base revenue, and are in 2012/13 prices. RIIO-ED2 base revenue is aligned to Ofgem's published draft determination converted into 2012/13 prices."]
["Annual Iteration adjustment before inflation (A2)","MOD","CRC2A",0,0,-1,-3,-6.1,-9.6999999999999993,-10,-7,-15.9,0.44862910712831278,0.45722936950132181,0.46641859283162285,0.46442032638178976,"2016/17 to 2021/22 aligned to the Ofgem directed values, with future years reflecting the assumed impact of the annual iteration process, which is primarily driven by revised cost of debt, legacy revenue and RAV adjustments, totex adjustments and corporation tax changes."]
["RPI True-up before inflation (A3)","TRU","CRC2A",0,0,0,-5.4795855896782246,-0.96465888633505792,0.60468699664446313,-0.25761930376446079,-2.2772051784902816,-3.2405004788995853,7.0189358762704774,10.687439950250377,-7.8265082717956722E-2,-1.4713621679863958E-2,"The RPI true-ups reflect the difference in RPI between forecasts prescribed in the distribution licence (sourced from annual (in November) HM Treasury 'Forecasts for the UK economy: a comparison of independent forecasts' publications) and the actual RPI for the same periods (forecasts being required due to the lag between performance/expenditure and when reflected in allowances, and in order to provide certainty and commonality in DNO assumptions). Figures are expressed in 2012/13 prices.\nThe 2015/16 to 2021/22 true-ups reflected in 2017/18 through to 2023/24 respectively are final and reflect variances between actual and prescribed forecast RPI.\nThe 2022/23 true-up in 2024/25 is primarily driven by 2021/22 actual RPI finalising at 5.78% compared to 2.50% prescribed when nominalising 2022/23 allowed revenue, and the latest forecast for 2022/23 at 8.30% compared to the prescribed 5.38%.\nThe minor variances in subsequent years are due to rounding, where Ofgem specify rounding of RPIF to three decimal places but not RPIA - the two are otherwise aligned."]
["Price index adjustment (A4)","RPIF","CRC2A",1.1671674547056599,1.0820000000000001,1.087,1.121,1.159,1.198,1.2170000000000001,1.238,1.321,1.468,1.4930000000000001,1.5209999999999999,1.5509999999999999,"Inflation is based on an average for the regulatory year t, and derived by applying two years forecast RPI inflation, as prescribed in the distribution licence, using the respective November HM Treasury 'Forecasts for the UK economy: a comparison of independent forecasts' publication, to actual RPI indices from year t-2.\nThe 2015/16 through to 2022/23 indices are final and reflect the relevant November HM Treasury publication forecasts applied to the latest (at the time) actual RPI indices.\nFor ED2 the indexation for the base revenue is based on the hybrid indexation as described in the GD financial hand book, and the indexation for the incentives is the forecast RPI from the latest HM Treasury forecasts. "]
["Base demand revenue (A): \n[A = (A1 + A2 + A3) * A4]","BR","CRC2A",{"$f":"(D8+D9+D10)*D11","v":328.09077151776103},{"$f":"(E8+E9+E10)*E11","v":269.52620000000002},266.85849999999999,266.8208845539707,277.50556035073765,284.41081502198006,287.50697730731866,293.68181998902901,{"$f":"(L8+L9+L10)*L11","v":300.34189886737363},373.74546249043686,{"$f":"(N8+N9+N10)*N11","v":370.34952123779908},354.2212048217238,{"$f":"(P8+P9+P10)*P11","v":355.53581276843352},"A = (A1 + A2 + A3) * A4"]
["Pass-Through Licence Fees (B1)","LF","CRC2B",-5.9722743628883856E-2,0,0,0.1390246963872579,-5.1980180020879278E-2,0.18928893977860001,0.20139241985012604,0.30578037527933005,0.3120960955673035,0.69170400084151518,0.41069668487932615,0,0,"Based on final up to and including 2021/22 licence fees and then inflation and other known increases going forward.  We currently expect to be broadly in line with allowances in RIIO-ED1.  Any variations in RIIO-ED1 will be recovered/returned with a two-year lag and time value of money adjustment."]
["Pass-Through Business Rates (B2)","RB","CRC2B",-0.90224963831465921,0,0,8.2189775100641765E-2,-9.9599855921101405E-2,2.5019128807096025,5.2765454419607432,5.2772417821352606,5.7097441050748099,4.7991820146440434,3.1428343635085154,0,0,"Latest business expectations which reflect transitional arrangements for the 2017 business rates revaluation, and which vary to the Ofgem allowances.  Any variations in RIIO-ED1 will be recovered/returned with a two-year lag and time value of money adjustment."]
["Pass-Through Transmission Connection Point Charges (B3)","TB","CRC2B",5.9568586793658662,0,0,0.51948640803089852,1.8450900797947123,0.28995728874299248,0.5489232986298932,-6.3246521283167892E-2,-0.38376115449901077,-4.3098807203312424,0.75181354949222767,0,0,"Based on the latest information from NGET and known future schemes, plus any valid interconnector charges.  Any variations in RIIO-ED1 will be recovered/returned with a two-year lag and time value of money adjustment."]
["Pass-through Smart Meter Communication Licence Costs (B4)","SMC","CRC2B",0,0,0,4.4073226394583706E-2,0.54209657163590663,0.58032458772067608,1.0041725759137781,1.3300855782280345,1.834304199796059,2.125100457551186,2.3823028853821242,0,0,"Represents new RIIO-ED1 pass-through allowances in smart meter Data Communications Company (DCC) costs, and we currently expect to exceed allowances.  Any variations will be recovered/returned with a two-year lag and time value of money adjustment."]
["Pass-through Smart Meter IT Costs (B5)","SMIT","CRC2B",0,0,0,0.33356751284466507,0.93408501518924769,0.36357649735505237,0.23461272274917841,-2.691665716189981E-2,3.7267111066524E-2,1.2338092104682967,0.45996068663707079,0,0,"Represents new RIIO-ED1 pass-through allowances in smart meter IT costs, in particular relating to non-operational capex in preparation for the smart meter rollout, and the building of the gateway to transfer data from smart meters into our internal systems."]
["Pass-through Ring Fence Costs (B6)","RF","CRC2B",0,0,0,3.2997818362695053E-2,3.2586838682266174E-2,3.3238998712468E-2,3.3227616089909762E-2,3.4118449288153226E-2,3.9868511617759464E-2,4.1324289752962706E-2,4.1539804548517641E-2,0,0,"We currently expect to be in line with allowances included within our base demand revenue."]
["Pass-through Supplier of Last Resort Adjustment (B7)","SLR","CRC2B",0,0,0,0,0,0,0,3.7112625226934683E-2,53.96705929413254,0.67483106912206348,1.1348779454228741,0,0,"Ofgem's decision to modify the licence on 2 May 2019 introduced a pass-through mechanism associated with costs incurred as a result of the appointment of a supplier of last resort (SoLR); primarily representing last resort supply payment (LRSP) claims received from a SoLR. \nA claim totalling £0.1m was received in October 2019 from Together Energy (Retail) Limited, which will be recovered in 2021/22 and 2022/23. \nA claim totalling £10k from Shell Energy Retail Limited was received in January 2020, and will be recovered in 2022/23.\nA claim totalling £0.4m was received in May 2020 from Ovo Energy Limited, which will be recovered in 2022/23 and 2023/24. \nA claim totalling £21k from Ovo Energy Limited, was received in October 2020, which will be recovered in 2022/23 and 2023/24.\nA claim totalling £0.3m from Scottish Power Energy Retail Energy was received in February 2021, which will be recovered in 2022/23 and 2023/24.\nA claim totalling £0.1m from EDF Energy Limited was received in May 2021, which will be recovered in 2023/24 and 2024/25.\nClaims totalling £54.7m from various suppliers were received in December 2021. Claims under the materiality threshold will be recovered in 2023/24 and 2024/25. Claims over the materiality threshold will be recovered in 2022/23, via change in tariffs published in January 2022."]
["Pass-through Eligible Bad Debt Adjustment (B8)","EBD","CRC2B",0,0,0,0,0,0,0,1.1132825842620402,0.35329944734617469,0.85225002401085315,2.8365638894196792,0,0,"Ofgem's decision to modify the licence on 2 May 2019 introduced a pass-through mechanism associated with use of system bad debt incurred since 1 April 2015.  In June 2019 we claimed for such debt incurred between 1 April 2015 and 31 March 2019 totalling £0.7m (excluding any time value of money adjustments), which will be recovered in 2021/22.  In June 2020 we claimed for debt incurred between 1 April 2019 and 31 March 2020 totalling £0.3m (excluding any time value of money adjustments), which will be recovered in 2022/23. In June 2021 we claimed for debt incurred between 1 April 2020 and 31 March 2021 totalling £0.6m (excluding any time value of money adjustments), which will be recovered in 2023/24. In June 2022 we claimed for debt incurred between 1 April 2021 and 31 March 2022 totalling £2.3m, which will be recovered in 2024/25. "]
{"$rows_left_out":37}
{"sheet":"Table 2","index":2,"n_rows":31,"n_cols":10,"rows_kept":31,"cut":false,"hidden":false,"merged":[[20,1,20,9],[21,1,21,9],[22,1,22,9],[23,1,23,9],[24,1,24,9],[4,1,4,3],[4,4,4,6],[4,7,4,9],[5,1,5,3],[5,4,5,6],[5,7,5,9],[29,1,29,9],[25,1,25,9],[26,1,26,9],[27,1,27,9],[30,1,30,9],[28,1,28,9]]}
["Company Name:",{"$f":"'Table 1'!B1","v":"Northern Powergrid (Northeast) plc"}]
["Date:",{"$f":"'Table 1'!B2","v":"August 2022"}]
["Title:","DCUSA Schedule 15 - Table 2 information"]
[]
["Description",{"$f":"INDIRECT(\"'Table 1'!\"&ADDRESS(ROW('Table 1'!$A$7),MATCH(\"t\",'Table 1'!$A$6:$Q$6,0)))","v":"2022/23"},null,null,{"$f":"LEFT(B5,4)+1&\"/\"&RIGHT(B5,2)+1","v":"2023/24"},null,null,{"$f":"LEFT(E5,4)+1&\"/\"&RIGHT(E5,2)+1","v":"2024/25"}]
["Regulatory Year","Regulatory Year t",null,null,"Regulatory Year t+1",null,null,"Regulatory Year t+2"]
["£m","Low","Central","High","Low","Central","High","Low","Central","High"]
["Under/over recovery",-11.865585577180445,{"$f":"SUMIF('Table 1'!$7:$7,B$5,'Table 1'!$53:$53)","v":-7.2046033697946541},-2.5436211624088632]
["RPI True-up",null,null,null,{"$f":"F9","v":7.0189358762704774},{"$f":"SUMIF('Table 1'!$7:$7,E$5,'Table 1'!$10:$10)","v":7.0189358762704774},{"$f":"F9","v":7.0189358762704774},0.87140516814989022,{"$f":"SUMIF('Table 1'!$7:$7,H$5,'Table 1'!$10:$10)","v":10.687439950250377},16.228805011494575]
["Annual Iteration",null,null,null,{"$f":"F10-1","v":-0.55137089287168717},{"$f":"SUMIF('Table 1'!$7:$7,E$5,'Table 1'!$9:$9)","v":0.44862910712831278},{"$f":"F10+1","v":1.4486291071283128},{"$f":"I10-1","v":-0.54277063049867813},{"$f":"SUMIF('Table 1'!$7:$7,H$5,'Table 1'!$9:$9)","v":0.45722936950132181},{"$f":"I10+1","v":1.4572293695013219}]
["Broad Measure of Customer Service",null,null,null,{"$f":"F11","v":0.87418515921937312},{"$f":"SUMIF('Table 1'!$7:$7,E$5,'Table 1'!$24:$24)","v":0.87418515921937312},0.87418515921937312,3.1677253499540208,{"$f":"SUMIF('Table 1'!$7:$7,H$5,'Table 1'!$24:$24)","v":4.079754796362522},4.9917842427710228]
["Quality of Service",null,null,null,{"$f":"F12","v":6.8806106473678383},{"$f":"SUMIF('Table 1'!$7:$7,E$5,'Table 1'!$25:$25)","v":6.8806106473678383},6.8806106473678383,{"$f":"I12","v":8.4721417239184138},{"$f":"SUMIF('Table 1'!$7:$7,H$5,'Table 1'!$25:$25)","v":8.4721417239184138},15.985227799096]
["Incentive on Connections Engagement",null,null,null,0,{"$f":"SUMIF('Table 1'!$7:$7,E$5,'Table 1'!$26:$26)","v":0},0,-0.12478062736282824,{"$f":"SUMIF('Table 1'!$7:$7,H$5,'Table 1'!$26:$26)","v":0},{"$f":"I13","v":0}]
["Time to Connect",null,null,null,3.6371181363032704E-2,{"$f":"SUMIF('Table 1'!$7:$7,E$5,'Table 1'!$27:$27)","v":0},{"$f":"F14","v":0},0,{"$f":"SUMIF('Table 1'!$7:$7,H$5,'Table 1'!$27:$27)","v":1.0979794661311972},{"$f":"I14","v":1.0979794661311972}]
["Low Carbon Network Fund",null,null,null,{"$f":"'Table 1'!L31","v":-0.17509968000000001},{"$f":"SUMPRODUCT(('Table 1'!$D$7:$P$7=E$5)*'Table 1'!$D$30:$P$31)","v":0},{"$f":"F15","v":0},{"$f":"E15","v":-0.17509968000000001},{"$f":"SUMPRODUCT(('Table 1'!$D$7:$P$7=H$5)*'Table 1'!$D$30:$P$31)","v":0},{"$f":"I15","v":0}]
["Energy Bills Support Scheme",null,null,null,0,0,61.729480000000002,0,0,61.729480000000002]
["Supplier of Last Resort",null,null,null,0,0,14.750330999999999,0,0,0]
["Final Collected Revenue Forecast",null,null,null,341.29235461554725,{"$f":"SUMIF('Table 1'!$7:$7,E$5,'Table 1'!$52:$52)","v":351.17835782824585},361.06436104094445,428.21944336587433,{"$f":"SUMIF('Table 1'!$7:$7,H$5,'Table 1'!$52:$52)","v":438.08010356788492},447.94076376989551]
[]
["Description","Comments (Note: central case is as per the forecasts presented)"]
{"$rows_left_out":12}
{"sheet":"Table 3","index":3,"n_rows":39,"n_cols":29,"rows_kept":39,"cut":false,"hidden":false,"merged":[[4,0,4,8],[4,10,4,18],[4,20,4,28]]}
["Company Name:",{"$f":"'Table 1'!B1","v":"Northern Powergrid (Northeast) plc"},null,null,null,null,null,null,null,null,"Company Name:",{"$f":"B1","v":"Northern Powergrid (Northeast) plc"},null,null,null,null,null,null,null,null,"Company Name:",{"$f":"L1","v":"Northern Powergrid (Northeast) plc"}]
["Date:",{"$f":"'Table 1'!B2","v":"August 2022"},null,null,null,null,null,null,null,null,"Date:",{"$f":"B2","v":"August 2022"},null,null,null,null,null,null,null,null,"Date:",{"$f":"L2","v":"August 2022"}]
["Title:","DCUSA Schedule 15 - Table 3 information",null,null,null,null,null,null,null,null,"Title:",{"$f":"B3","v":"DCUSA Schedule 15 - Table 3 information"},null,null,null,null,null,null,null,null,"Title:",{"$f":"L3","v":"DCUSA Schedule 15 - Table 3 information"}]
["Illustrative Charging Year:",{"$f":"'Table 2'!$H$5&\" (t+2)\"","v":"2024/25 (t+2)"},null,null,null,null,null,null,null,null,"Illustrative Charging Year:",{"$f":"LEFT(B4,4)+1&\"/\"&MID(B4,6,2)+1&\" (\"&INDIRECT(\"'Table 1'!\"&ADDRESS(6,MATCH(LEFT(B4,4)+1&\"/\"&MID(B4,6,2)+1,'Table 1'!$7:$7,0)))&\")\"","v":"2025/26 (t+3)"},null,null,null,null,null,null,null,null,"Illustrative Charging Year:",{"$f":"LEFT(L4,4)+1&\"/\"&MID(L4,6,2)+1&\" (\"&INDIRECT(\"'Table 1'!\"&ADDRESS(6,MATCH(LEFT(L4,4)+1&\"/\"&MID(L4,6,2)+1,'Table 1'!$7:$7,0)))&\")\"","v":"2026/27 (t+4)"}]
["PLEASE NOTE THAT THESE ARE ILLUSTRATIVE TARIFFS ONLY AND ARE NOT TO BE CONSIDERED TO REPRESENT THE FINAL TARIFFS WHICH WILL BE APPLIED BY THIS COMPANY",null,null,null,null,null,null,null,null,null,"PLEASE NOTE THAT THESE ARE ILLUSTRATIVE TARIFFS ONLY AND ARE NOT TO BE CONSIDERED TO REPRESENT THE FINAL TARIFFS WHICH WILL BE APPLIED BY THIS COMPANY",null,null,null,null,null,null,null,null,null,"PLEASE NOTE THAT THESE ARE ILLUSTRATIVE TARIFFS ONLY AND ARE NOT TO BE CONSIDERED TO REPRESENT THE FINAL TARIFFS WHICH WILL BE APPLIED BY THIS COMPANY"]
[]
[null,"PCs","Unit rate 1 p/kWh","Unit rate 2 p/kWh","Unit rate 3 p/kWh","Fixed charge p/MPAN/day","Capacity charge p/kVA/day","Exceeded capacity charge p/kVA/day","Reactive power charge p/kVArh",null,null,"PCs","Unit rate 1 p/kWh","Unit rate 2 p/kWh","Unit rate 3 p/kWh","Fixed charge p/MPAN/day","Capacity charge p/kVA/day","Exceeded capacity charge p/kVA/day","Reactive power charge p/kVArh",null,null,"PCs","Unit rate 1 p/kWh","Unit rate 2 p/kWh","Unit rate 3 p/kWh","Fixed charge p/MPAN/day","Capacity charge p/kVA/day","Exceeded capacity charge p/kVA/day","Reactive power charge p/kVArh"]
["Domestic Aggregated with Residual","0, 1 or 2",7.09,1.0529999999999999,0.216,24.05,0,0,0,null,"Domestic Aggregated with Residual","0, 1 or 2",7.1269999999999998,1.054,0.216,17.71,0,0,0,null,"Domestic Aggregated with Residual","0, 1 or 2",7.165,1.056,0.216,17.760000000000002,0,0,0]
["Domestic Aggregated (Related MPAN)",2,7.09,1.0529999999999999,0.216,0,0,0,0,null,"Domestic Aggregated (Related MPAN)",2,7.1269999999999998,1.054,0.216,0,0,0,0,null,"Domestic Aggregated (Related MPAN)",2,7.165,1.056,0.216,0,0,0,0]
["Non-Domestic Aggregated No Residual","3, 4 or 5-8",7.8170000000000002,1.161,0.23799999999999999,7.6,0,0,0,null,"Non-Domestic Aggregated No Residual","3, 4 or 5-8",7.8579999999999997,1.163,0.23799999999999999,7.14,0,0,0,null,"Non-Domestic Aggregated No Residual","3, 4 or 5-8",7.9,1.1639999999999999,0.23799999999999999,7.14,0,0,0]
["Non-Domestic Aggregated Band 1","3, 4 or 5-8",7.8170000000000002,1.161,0.23799999999999999,15.45,0,0,0,null,"Non-Domestic Aggregated Band 1","3, 4 or 5-8",7.8579999999999997,1.163,0.23799999999999999,12.3,0,0,0,null,"Non-Domestic Aggregated Band 1","3, 4 or 5-8",7.9,1.1639999999999999,0.23799999999999999,12.33,0,0,0]
["Non-Domestic Aggregated Band 2","3, 4 or 5-8",7.8170000000000002,1.161,0.23799999999999999,49.06,0,0,0,null,"Non-Domestic Aggregated Band 2","3, 4 or 5-8",7.8579999999999997,1.163,0.23799999999999999,34.43,0,0,0,null,"Non-Domestic Aggregated Band 2","3, 4 or 5-8",7.9,1.1639999999999999,0.23799999999999999,34.549999999999997,0,0,0]
["Non-Domestic Aggregated Band 3","3, 4 or 5-8",7.8170000000000002,1.161,0.23799999999999999,110.71,0,0,0,null,"Non-Domestic Aggregated Band 3","3, 4 or 5-8",7.8579999999999997,1.163,0.23799999999999999,75.010000000000005,0,0,0,null,"Non-Domestic Aggregated Band 3","3, 4 or 5-8",7.9,1.1639999999999999,0.23799999999999999,75.319999999999993,0,0,0]
["Non-Domestic Aggregated Band 4","3, 4 or 5-8",7.8170000000000002,1.161,0.23799999999999999,319.55,0,0,0,null,"Non-Domestic Aggregated Band 4","3, 4 or 5-8",7.8579999999999997,1.163,0.23799999999999999,212.45,0,0,0,null,"Non-Domestic Aggregated Band 4","3, 4 or 5-8",7.9,1.1639999999999999,0.23799999999999999,213.39,0,0,0]
["Non-Domestic Aggregated (Related MPAN)",4,7.8170000000000002,1.161,0.23799999999999999,0,0,0,0,null,"Non-Domestic Aggregated (Related MPAN)",4,7.8579999999999997,1.163,0.23799999999999999,0,0,0,0,null,"Non-Domestic Aggregated (Related MPAN)",4,7.9,1.1639999999999999,0.23799999999999999,0,0,0,0]
["LV Site Specific No Residual",0,5.7480000000000002,0.83,0.16700000000000001,14.63,2.08,4.42,0.14599999999999999,null,"LV Site Specific No Residual",0,5.7830000000000004,0.83099999999999996,0.16700000000000001,14.17,2.08,4.42,0.14599999999999999,null,"LV Site Specific No Residual",0,5.8170000000000002,0.83199999999999996,0.16700000000000001,14.17,2.08,4.42,0.14699999999999999]
["LV Site Specific Band 1",0,5.7480000000000002,0.83,0.16700000000000001,479.4,2.08,4.42,0.14599999999999999,null,"LV Site Specific Band 1",0,5.7830000000000004,0.83099999999999996,0.16700000000000001,320.06,2.08,4.42,0.14599999999999999,null,"LV Site Specific Band 1",0,5.8170000000000002,0.83199999999999996,0.16700000000000001,321.45999999999998,2.08,4.42,0.14699999999999999]
["LV Site Specific Band 2",0,5.7480000000000002,0.83,0.16700000000000001,1071.3699999999999,2.08,4.42,0.14599999999999999,null,"LV Site Specific Band 2",0,5.7830000000000004,0.83099999999999996,0.16700000000000001,709.66,2.08,4.42,0.14599999999999999,null,"LV Site Specific Band 2",0,5.8170000000000002,0.83199999999999996,0.16700000000000001,712.84,2.08,4.42,0.14699999999999999]
["LV Site Specific Band 3",0,5.7480000000000002,0.83,0.16700000000000001,1637.4,2.08,4.42,0.14599999999999999,null,"LV Site Specific Band 3",0,5.7830000000000004,0.83099999999999996,0.16700000000000001,1082.19,2.08,4.42,0.14599999999999999,null,"LV Site Specific Band 3",0,5.8170000000000002,0.83199999999999996,0.16700000000000001,1087.08,2.08,4.42,0.14699999999999999]
["LV Site Specific Band 4",0,5.7480000000000002,0.83,0.16700000000000001,4182.7,2.08,4.42,0.14599999999999999,null,"LV Site Specific Band 4",0,5.7830000000000004,0.83099999999999996,0.16700000000000001,2757.36,2.08,4.42,0.14599999999999999,null,"LV Site Specific Band 4",0,5.8170000000000002,0.83199999999999996,0.16700000000000001,2769.92,2.08,4.42,0.14699999999999999]
{"$rows_left_out":20}
{"sheet":"Volumes","index":4,"n_rows":0,"n_cols":0,"rows_kept":0,"cut":false,"hidden":true,"merged":[]}

{"sheet":"Volumes Variance","index":5,"n_rows":0,"n_cols":0,"rows_kept":0,"cut":false,"hidden":true,"merged":[]}